{"text_format":"1","workbook":"xlsx","n_sheets":2,"sheets":["Gütesiegel","Daten"],"not_rendered":{"charts":0,"images":1,"macros":1,"external_links":0,"defined_names":2,"comments":0,"pivot_tables":0},"unopened":[],"bounds":{"document_bytes":16777216,"sheet_cells":100000,"rows_first":2000,"rows_last":500,"rows_between":2000,"halvings":0,"cell_chars":16384,"cell_head_chars":4096},"cells_cut":0,"cells_raw":0,"read":"whole","date_system":"1900"}

{"sheet":"Gütesiegel","index":0,"n_rows":21,"n_cols":18,"rows_kept":21,"cut":false,"hidden":false,"merged":[[0,0,0,10],[5,1,5,2],[7,5,7,7]]}
["Gütesiegel Stiebel Eltron Wärmepumpen"]
[]
[]
[]
[null,null,null,null,null,"Quelle:",null,"Betriebsart:"]
[null,"Wärmepumpe auswählen",null,null,null,{"$f":"VLOOKUP(B6,Daten!A:D,2,0)","v":0},null,{"$f":"VLOOKUP(B6,Daten!A:D,3,0)","v":0}]
[]
[null,null,null,null,null,{"$f":"VLOOKUP(B6,Daten!A:F,6,0)","v":"Gütesiegel"}]
[]
[]
[]
[]
[]
[null,{"$f":"HYPERLINK(R17,\"Öffnen\")","v":"Öffnen"},null,{"$f":"HYPERLINK(R21,\"PDF herunterladen\")","v":"PDF herunterladen"}]
[]
["Stiebel Eltron AG | Industrie West Gass 8 | 5242 Lupfig"]
[null,null,null,null,null,null,null,null,null,null,null,null,null,null,null,null,null,{"$f":"VLOOKUP(B6,Daten!A:D,4,0)","v":0}]
[null,null,null,null,null,null,null,null,null,null,null,null,null,null,null,null,null,{"$f":"HYPERLINK(R17)","v":"0"}]
[]
[null,null,null,null,null,null,null,null,null,null,null,null,null,null,null,null,null,{"$f":"VLOOKUP(B6,Daten!A:E,5,0)","v":"PDF  herunterladen"}]
[null,null,null,null,null,null,null,null,null,null,null,null,null,null,null,null,null,{"$f":"HYPERLINK(R20)","v":"PDF  herunterladen"}]

{"sheet":"Daten","index":1,"n_rows":96,"n_cols":6,"rows_kept":96,"cut":false,"hidden":true,"merged":[]}
["Wärmepumpe auswählen",null,null,null,"PDF  herunterladen","Gütesiegel"]
["Auswahl Luft|Wasser Wärmepumpen"]
["LWZ 504 E","Luft/Wasser","Inverter","http://www.ehpa.org/index.php?id=233&no_cache=1&L=1&tx_ehpaqualitylabel_pi2%5Bmodel%5D=9255&cHash=659a29ac51b5e0d0182dc24b803c06f4","http://www.ehpa.org/uploads/qlcert/1521/CH-HP-00534.pdf","Gütesiegel vorhanden"]
["WPL 09 ICS classic","Luft/Wasser","Inverter","https://www.ehpa.org/index.php?id=233&no_cache=1&L=1&tx_ehpaqualitylabel_pi2%5Bmodel%5D=14714&cHash=ad359958260210cde77fd4dc4063d9fc","https://www.ehpa.org/uploads/qlcert/2400/CH-HP-00807.pdf","Gütesiegel vorhanden"]
["WPL 09 IKCS classic","Luft/Wasser","Inverter","https://www.ehpa.org/index.php?id=233&no_cache=1&L=1&tx_ehpaqualitylabel_pi2%5Bmodel%5D=14714&cHash=ad359958260210cde77fd4dc4063d9fc","https://www.ehpa.org/uploads/qlcert/2400/CH-HP-00807.pdf","Gütesiegel vorhanden"]
["WPL 09 ACS classic","Luft/Wasser","Inverter","http://www.ehpa.org/index.php?id=233&no_cache=1&L=1&tx_ehpaqualitylabel_pi2%5Bmodel%5D=12541&cHash=deedd4d8fc6b3c1d3a18cbd2040d4615","http://www.ehpa.org/uploads/qlcert/2077/CH-HP-00684.pdf","Gütesiegel vorhanden"]
["WPL 10 AC","Luft/Wasser","On/Off","http://www.ehpa.org/index.php?id=233&no_cache=1&L=1&tx_ehpaqualitylabel_pi2%5Bmodel%5D=8860&cHash=deeacc1f80d0cedc0aac0a9c36c0e8b9","http://www.ehpa.org/uploads/qlcert/1464/CH-HP-00519.pdf","Gütesiegel vorhanden"]
["WPL 10 I","Luft/Wasser","On/Off","http://www.ehpa.org/index.php?id=233&no_cache=1&L=1&tx_ehpaqualitylabel_pi2%5Bmodel%5D=4334&cHash=1b87b1551b25a316aeb57398c6d65b17","http://www.ehpa.org/uploads/qlcert/611/CH-HP-00198.pdf","Gütesiegel vorhanden"]
["WPL 10 IK 3","Luft/Wasser","On/Off","http://www.ehpa.org/index.php?id=233&no_cache=1&L=1&tx_ehpaqualitylabel_pi2%5Bmodel%5D=4336&cHash=f302a183354280dd276a2fa98cf7a314","http://www.ehpa.org/uploads/qlcert/611/CH-HP-00198.pdf","Gütesiegel vorhanden"]
["WPL 13 E","Luft/Wasser","On/Off","http://www.ehpa.org/index.php?id=232&no_cache=1&L=1&tx_ehpaqualitylabel_pi2%5Bcountry%5D=CH&tx_ehpaqualitylabel_pi2%5Bhp_type%5D=0&tx_ehpaqualitylabel_pi2%5Bdistributor%5D=191&tx_ehpaqualitylabel_pi2%5Bsubmit%5D=suchen","http://www.ehpa.org/uploads/qlcert/1522/CH-HP-00535.pdf","Gütesiegel vorhanden"]
["WPL 15 ACS","Luft/Wasser","Inverter","http://www.ehpa.org/index.php?id=233&no_cache=1&L=1&tx_ehpaqualitylabel_pi2%5Bmodel%5D=9928&cHash=d577c11f7b0e642a3adbe1c641ffaeeb","http://www.ehpa.org/uploads/qlcert/1265/CH-HP-00465.pdf","Gütesiegel vorhanden"]
["WPL 15 AS","Luft/Wasser","Inverter","http://www.ehpa.org/index.php?id=233&no_cache=1&L=1&tx_ehpaqualitylabel_pi2%5Bmodel%5D=7822&cHash=2be5f17b5e5bbb663d0aa06f08c3f964","http://www.ehpa.org/uploads/qlcert/1265/CH-HP-00465.pdf","Gütesiegel vorhanden"]
["WPL 15 IS-2","Luft/Wasser","Inverter","http://www.ehpa.org/index.php?id=233&no_cache=1&L=1&tx_ehpaqualitylabel_pi2%5Bmodel%5D=8814&cHash=134964a257ed8798dc5149879c2c5242","http://www.ehpa.org/uploads/qlcert/1183/CH-HP-00428.pdf","Gütesiegel vorhanden"]
["WPL 17 ICS classic","Luft/Wasser","Inverter","https://www.ehpa.org/index.php?id=233&no_cache=1&L=1&tx_ehpaqualitylabel_pi2%5Bmodel%5D=14715&cHash=6b1fedc60d303343f3def9bdb91d6966","https://www.ehpa.org/uploads/qlcert/2400/CH-HP-00807.pdf","Gütesiegel vorhanden"]
["WPL 17 IKCS classic","Luft/Wasser","Inverter","https://www.ehpa.org/index.php?id=233&no_cache=1&L=1&tx_ehpaqualitylabel_pi2%5Bmodel%5D=14716&cHash=e9b2b7503d08a4915364bc4f68260a61","https://www.ehpa.org/uploads/qlcert/2400/CH-HP-00807.pdf","Gütesiegel vorhanden"]
["WPL 17 ACS classic","Luft/Wasser","Inverter","http://www.ehpa.org/index.php?id=233&no_cache=1&L=1&tx_ehpaqualitylabel_pi2%5Bmodel%5D=12542&cHash=1b64ddb51d393d53e2274048bbf64993","http://www.ehpa.org/uploads/qlcert/2077/CH-HP-00684.pdf","Gütesiegel vorhanden"]
["WPL 18 E","Luft/Wasser","On/Off","http://www.ehpa.org/index.php?id=232&no_cache=1&L=1&tx_ehpaqualitylabel_pi2%5Bcountry%5D=CH&tx_ehpaqualitylabel_pi2%5Bhp_type%5D=0&tx_ehpaqualitylabel_pi2%5Bdistributor%5D=191&tx_ehpaqualitylabel_pi2%5Bsubmit%5D=suchen","http://www.ehpa.org/uploads/qlcert/1522/CH-HP-00535.pdf","Gütesiegel vorhanden"]
["WPL 19 A","Luft/Wasser","Inverter","http://www.ehpa.org/index.php?id=233&no_cache=1&L=1&tx_ehpaqualitylabel_pi2%5Bmodel%5D=12148&cHash=8b5846a358c6456f8ad9b3ac81b1f8bc","http://www.ehpa.org/uploads/qlcert/2031/CH-HP-00667.pdf","Gütesiegel vorhanden"]
["WPL 19 A SR","Luft/Wasser","Inverter","http://www.ehpa.org/index.php?id=233&no_cache=1&L=1&tx_ehpaqualitylabel_pi2%5Bmodel%5D=12149&cHash=33cc1409505d8956560231f49ba57b70","http://www.ehpa.org/uploads/qlcert/2031/CH-HP-00667.pdf","Gütesiegel vorhanden"]
["WPL 19 I","Luft/Wasser","Inverter","http://www.ehpa.org/index.php?id=233&no_cache=1&L=1&tx_ehpaqualitylabel_pi2%5Bmodel%5D=12146&cHash=1bf617c15a71a4653b97f58d19a7e793","http://www.ehpa.org/uploads/qlcert/2031/CH-HP-00667.pdf","Gütesiegel vorhanden"]
["WPL 19 IK","Luft/Wasser","Inverter","http://www.ehpa.org/index.php?id=233&no_cache=1&L=1&tx_ehpaqualitylabel_pi2%5Bmodel%5D=12147&cHash=c617746bb6ad84fa6ab68e0130ad1e07","http://www.ehpa.org/uploads/qlcert/2031/CH-HP-00667.pdf","Gütesiegel vorhanden"]
["WPL 20 A","Luft/Wasser","Inverter","http://www.ehpa.org/index.php?id=233&no_cache=1&L=1&tx_ehpaqualitylabel_pi2%5Bmodel%5D=11745&cHash=9654beda50dd011cbbba39ce7f8aee58","http://www.ehpa.org/uploads/qlcert/1265/CH-HP-00465.pdf","Gütesiegel vorhanden"]
["WPL 20 AC","Luft/Wasser","Inverter","http://www.ehpa.org/index.php?id=233&no_cache=1&L=1&tx_ehpaqualitylabel_pi2%5Bmodel%5D=11749&cHash=5fbdcf714a89f3831fa92c86da4a2d63","http://www.ehpa.org/uploads/qlcert/1265/CH-HP-00465.pdf","Gütesiegel vorhanden"]
["WPL 23 E","Luft/Wasser","On/Off","http://www.ehpa.org/index.php?id=232&no_cache=1&L=1&tx_ehpaqualitylabel_pi2%5Bcountry%5D=CH&tx_ehpaqualitylabel_pi2%5Bhp_type%5D=0&tx_ehpaqualitylabel_pi2%5Bdistributor%5D=191&tx_ehpaqualitylabel_pi2%5Bsubmit%5D=suchen","http://www.ehpa.org/uploads/qlcert/1522/CH-HP-00535.pdf","Gütesiegel vorhanden"]
["WPL 23 E cool","Luft/Wasser","On/Off","http://www.ehpa.org/index.php?id=233&no_cache=1&L=1&tx_ehpaqualitylabel_pi2%5Bmodel%5D=11761&cHash=1cd305524ba7505fe96da536f69a4aee","http://www.ehpa.org/uploads/qlcert/1963/CH-HP-00648.pdf","Gütesiegel vorhanden"]
["WPL 24 A","Luft/Wasser","Inverter","http://www.ehpa.org/index.php?id=233&no_cache=1&L=1&tx_ehpaqualitylabel_pi2%5Bmodel%5D=12152&cHash=a8227756706caf45070e784740df79b9","http://www.ehpa.org/uploads/qlcert/2031/CH-HP-00667.pdf","Gütesiegel vorhanden"]
["WPL 24 A SR","Luft/Wasser","Inverter","http://www.ehpa.org/index.php?id=233&no_cache=1&L=1&tx_ehpaqualitylabel_pi2%5Bmodel%5D=12153&cHash=26c71583fd601982296a5068dfe98e49","http://www.ehpa.org/uploads/qlcert/2031/CH-HP-00667.pdf","Gütesiegel vorhanden"]
["WPL 24 I","Luft/Wasser","Inverter","http://www.ehpa.org/index.php?id=233&no_cache=1&L=1&tx_ehpaqualitylabel_pi2%5Bmodel%5D=12150&cHash=4b38f8839d69f8798dc1b8b31349cd2e","http://www.ehpa.org/uploads/qlcert/2031/CH-HP-00667.pdf","Gütesiegel vorhanden"]
["WPL 24 IK","Luft/Wasser","Inverter","http://www.ehpa.org/index.php?id=233&no_cache=1&L=1&tx_ehpaqualitylabel_pi2%5Bmodel%5D=12151&cHash=85d45fed18f175ba804ffcc504002df7","http://www.ehpa.org/uploads/qlcert/2031/CH-HP-00667.pdf","Gütesiegel vorhanden"]
["WPL 25 A","Luft/Wasser","Inverter","http://www.ehpa.org/index.php?id=233&no_cache=1&L=1&tx_ehpaqualitylabel_pi2%5Bmodel%5D=7823&cHash=7758c43c43a0a52204c1e5d82018fee3","http://www.ehpa.org/uploads/qlcert/1265/CH-HP-00465.pdf","Gütesiegel vorhanden"]
["WPL 25 AC","Luft/Wasser","Inverter","http://www.ehpa.org/index.php?id=233&no_cache=1&L=1&tx_ehpaqualitylabel_pi2%5Bmodel%5D=9932&cHash=f3a1e6978c9bc0de3a08bde4f9196970","http://www.ehpa.org/uploads/qlcert/1265/CH-HP-00465.pdf","Gütesiegel vorhanden"]
["WPL 25 I-2","Luft/Wasser","Inverter","http://www.ehpa.org/index.php?id=233&no_cache=1&L=1&tx_ehpaqualitylabel_pi2%5Bmodel%5D=7391&cHash=436dbe5b29d5a43ec2023eb6d6ad8979","http://www.ehpa.org/uploads/qlcert/1183/CH-HP-00428.pdf","Gütesiegel vorhanden"]
["WPL 33 HT","Luft/Wasser","Inverter","http://www.ehpa.org/index.php?id=232&no_cache=1&L=1&tx_ehpaqualitylabel_pi2%5Bcountry%5D=CH&tx_ehpaqualitylabel_pi2%5Bhp_type%5D=0&tx_ehpaqualitylabel_pi2%5Bdistributor%5D=191&tx_ehpaqualitylabel_pi2%5Bsubmit%5D=suchen","http://www.ehpa.org/uploads/qlcert/1699/CH-HP-00582.pdf","Gütesiegel vorhanden"]
["WPL 44 AC","Luft/Wasser","On/Off","http://www.ehpa.org/index.php?id=233&no_cache=1&L=1&tx_ehpaqualitylabel_pi2%5Bmodel%5D=11984&cHash=352d93ebff2592605fdef0ed4789c8eb","http://www.ehpa.org/uploads/qlcert/2004/CH-HP-00655.pdf","Gütesiegel vorhanden"]
["WPL 60 AC","Luft/Wasser","On/Off","http://www.ehpa.org/index.php?id=233&no_cache=1&L=1&tx_ehpaqualitylabel_pi2%5Bmodel%5D=11985&cHash=ac515547674a3d64c821d379ffae3332","http://www.ehpa.org/uploads/qlcert/2004/CH-HP-00655.pdf","Gütesiegel vorhanden"]
["WPL 130 AC","Luft/Wasser","On/Off","http://www.ehpa.org/index.php?id=232&no_cache=1&L=1&tx_ehpaqualitylabel_pi2%5Bcountry%5D=CH&tx_ehpaqualitylabel_pi2%5Bhp_type%5D=0&tx_ehpaqualitylabel_pi2%5Bdistributor%5D=191&tx_ehpaqualitylabel_pi2%5Bsubmit%5D=suchen","https://www.stiebel-eltron.ch/de/home/service/planung/anfrage-technische-informationen.html","Gütesiegel nicht vorhanden"]
["WPL 47","Luft/Wasser","On/Off","http://www.ehpa.org/index.php?id=233&no_cache=1&L=1&tx_ehpaqualitylabel_pi2%5Bmodel%5D=8044&cHash=4b13a474790ff29a307f4e4c457cb1f6","http://www.ehpa.org/uploads/qlcert/1305/CH-HP-00479.pdf","Gütesiegel vorhanden"]
["WPL 57","Luft/Wasser","On/Off","http://www.ehpa.org/index.php?id=233&no_cache=1&L=1&tx_ehpaqualitylabel_pi2%5Bmodel%5D=8045&cHash=acf66c666078e1f834a3b92506c96086","http://www.ehpa.org/uploads/qlcert/1305/CH-HP-00479.pdf","Gütesiegel vorhanden"]
["Auswahl Sole|Wasser Wärmepumpen"]
["WPC 04","Sole/Wasser","On/Off","http://www.ehpa.org/index.php?id=233&no_cache=1&L=1&tx_ehpaqualitylabel_pi2%5Bmodel%5D=8785&cHash=0574df6bcc374213b31d47cdabe18eb1","http://www.ehpa.org/uploads/qlcert/1449/CH-HP-00513.pdf","Gütesiegel vorhanden"]
["WPC 04 cool","Sole/Wasser","On/Off","http://www.ehpa.org/index.php?id=233&no_cache=1&L=1&tx_ehpaqualitylabel_pi2%5Bmodel%5D=8790&cHash=e69a56312a68e4ee317e3380978b2cbf","http://www.ehpa.org/uploads/qlcert/1449/CH-HP-00513.pdf","Gütesiegel vorhanden"]
["WPC 05","Sole/Wasser","On/Off","http://www.ehpa.org/index.php?id=233&no_cache=1&L=1&tx_ehpaqualitylabel_pi2%5Bmodel%5D=8786&cHash=3474a79b07ed1470cf981f13407b8002","http://www.ehpa.org/uploads/qlcert/1449/CH-HP-00513.pdf","Gütesiegel vorhanden"]
["WPC 05 cool","Sole/Wasser","On/Off","http://www.ehpa.org/index.php?id=233&no_cache=1&L=1&tx_ehpaqualitylabel_pi2%5Bmodel%5D=8791&cHash=b627fa89547d1968e8dec760b993024c","http://www.ehpa.org/uploads/qlcert/1449/CH-HP-00513.pdf","Gütesiegel vorhanden"]
["WPC 07","Sole/Wasser","On/Off","http://www.ehpa.org/index.php?id=233&no_cache=1&L=1&tx_ehpaqualitylabel_pi2%5Bmodel%5D=8787&cHash=e5a20156c45900d21adad12677668137","http://www.ehpa.org/uploads/qlcert/1449/CH-HP-00513.pdf","Gütesiegel vorhanden"]
["WPC 07 cool","Sole/Wasser","On/Off","http://www.ehpa.org/index.php?id=233&no_cache=1&L=1&tx_ehpaqualitylabel_pi2%5Bmodel%5D=8792&cHash=f8b918ac57c46c4ecce33a51da1d2783","http://www.ehpa.org/uploads/qlcert/1449/CH-HP-00513.pdf","Gütesiegel vorhanden"]
["WPC 10","Sole/Wasser","On/Off","http://www.ehpa.org/index.php?id=233&no_cache=1&L=1&tx_ehpaqualitylabel_pi2%5Bmodel%5D=8788&cHash=bcd1380cee7b12a36050fe5820e9ee52","http://www.ehpa.org/uploads/qlcert/788/CH-HP-00304.pdf","Gütesiegel vorhanden"]
["WPC 10 cool","Sole/Wasser","On/Off","http://www.ehpa.org/index.php?id=233&no_cache=1&L=1&tx_ehpaqualitylabel_pi2%5Bmodel%5D=8793&cHash=62f7e4600f72c70052fdbe053797db2b","http://www.ehpa.org/uploads/qlcert/788/CH-HP-00304.pdf","Gütesiegel vorhanden"]
["WPC 13","Sole/Wasser","On/Off","http://www.ehpa.org/index.php?id=233&no_cache=1&L=1&tx_ehpaqualitylabel_pi2%5Bmodel%5D=8789&cHash=967fab9f26eda8717876b80d5aceae46","http://www.ehpa.org/uploads/qlcert/788/CH-HP-00304.pdf","Gütesiegel vorhanden"]
["WPC 13 cool","Sole/Wasser","On/Off","http://www.ehpa.org/index.php?id=233&no_cache=1&L=1&tx_ehpaqualitylabel_pi2%5Bmodel%5D=8794&cHash=628510a96fe569b0de2487adc593ebdf","http://www.ehpa.org/uploads/qlcert/1449/CH-HP-00513.pdf","Gütesiegel vorhanden"]
["WPF 04","Sole/Wasser","On/Off","http://www.ehpa.org/index.php?id=233&no_cache=1&L=1&tx_ehpaqualitylabel_pi2%5Bmodel%5D=8773&cHash=2eff272635722dc4ec8276342ac4d5a5","http://www.ehpa.org/uploads/qlcert/1449/CH-HP-00513.pdf","Gütesiegel vorhanden"]
["WPF 04 cool","Sole/Wasser","On/Off","http://www.ehpa.org/index.php?id=233&no_cache=1&L=1&tx_ehpaqualitylabel_pi2%5Bmodel%5D=8779&cHash=82e2b9578cc498a16040acddd5179416","http://www.ehpa.org/uploads/qlcert/1449/CH-HP-00513.pdf","Gütesiegel vorhanden"]
["WPF 05","Sole/Wasser","On/Off","http://www.ehpa.org/index.php?id=233&no_cache=1&L=1&tx_ehpaqualitylabel_pi2%5Bmodel%5D=8774&cHash=5e3e06e929504553b1e7c281a319b695","http://www.ehpa.org/uploads/qlcert/1449/CH-HP-00513.pdf","Gütesiegel vorhanden"]
["WPF 05 cool","Sole/Wasser","On/Off","http://www.ehpa.org/index.php?id=233&no_cache=1&L=1&tx_ehpaqualitylabel_pi2%5Bmodel%5D=8780&cHash=519b7b32f55bbd07d09240691cabecb8","http://www.ehpa.org/uploads/qlcert/1449/CH-HP-00513.pdf","Gütesiegel vorhanden"]
["WPF 07","Sole/Wasser","On/Off","http://www.ehpa.org/index.php?id=233&no_cache=1&L=1&tx_ehpaqualitylabel_pi2%5Bmodel%5D=8775&cHash=cb51ae8d547706d6afb1f7f0b0ad0b77","http://www.ehpa.org/uploads/qlcert/1449/CH-HP-00513.pdf","Gütesiegel vorhanden"]
["WPF 07 cool","Sole/Wasser","On/Off","http://www.ehpa.org/index.php?id=233&no_cache=1&L=1&tx_ehpaqualitylabel_pi2%5Bmodel%5D=8781&cHash=96eb35000d4a6ae8443703a6338b1986","http://www.ehpa.org/uploads/qlcert/1449/CH-HP-00513.pdf","Gütesiegel vorhanden"]
["WPF 10","Sole/Wasser","On/Off","http://www.ehpa.org/index.php?id=233&no_cache=1&L=1&tx_ehpaqualitylabel_pi2%5Bmodel%5D=8776&cHash=22a30be43da97318fef33a186914342b","http://www.ehpa.org/uploads/qlcert/1449/CH-HP-00513.pdf","Gütesiegel vorhanden"]
["WPF 10 cool","Sole/Wasser","On/Off","http://www.ehpa.org/index.php?id=233&no_cache=1&L=1&tx_ehpaqualitylabel_pi2%5Bmodel%5D=8782&cHash=b380ed64da6b2d6339631ca0610ffad0","http://www.ehpa.org/uploads/qlcert/1449/CH-HP-00513.pdf","Gütesiegel vorhanden"]
["WPF 13","Sole/Wasser","On/Off","http://www.ehpa.org/index.php?id=233&no_cache=1&L=1&tx_ehpaqualitylabel_pi2%5Bmodel%5D=8777&cHash=f622dad4553fe6c34f25bfa365b3dab1","http://www.ehpa.org/uploads/qlcert/1449/CH-HP-00513.pdf","Gütesiegel vorhanden"]
["WPF 13 cool","Sole/Wasser","On/Off","http://www.ehpa.org/index.php?id=233&no_cache=1&L=1&tx_ehpaqualitylabel_pi2%5Bmodel%5D=8783&cHash=c15e151d7f7b0397fc734c7234ad3712","http://www.ehpa.org/uploads/qlcert/1449/CH-HP-00513.pdf","Gütesiegel vorhanden"]
["WPF 16","Sole/Wasser","On/Off","http://www.ehpa.org/index.php?id=233&no_cache=1&L=1&tx_ehpaqualitylabel_pi2%5Bmodel%5D=8778&cHash=195d8cc2e29570c798981ad421d0c9ad","http://www.ehpa.org/uploads/qlcert/1449/CH-HP-00513.pdf","Gütesiegel vorhanden"]
["WPF 16 cool","Sole/Wasser","On/Off","http://www.ehpa.org/index.php?id=233&no_cache=1&L=1&tx_ehpaqualitylabel_pi2%5Bmodel%5D=8784&cHash=db0c60a2310fd54d9fc6f6b7712857f1","http://www.ehpa.org/uploads/qlcert/1449/CH-HP-00513.pdf","Gütesiegel vorhanden"]
["WPF 20","Sole/Wasser","On/Off","http://www.ehpa.org/index.php?id=232&no_cache=1&L=1&tx_ehpaqualitylabel_pi2%5Bcountry%5D=CH&tx_ehpaqualitylabel_pi2%5Bhp_type%5D=0&tx_ehpaqualitylabel_pi2%5Bdistributor%5D=191&tx_ehpaqualitylabel_pi2%5Bsubmit%5D=suchen","http://www.ehpa.org/uploads/qlcert/683/CH-HP-00270.pdf","Gütesiegel vorhanden"]
["WPF 27","Sole/Wasser","On/Off","http://www.ehpa.org/index.php?id=232&no_cache=1&L=1&tx_ehpaqualitylabel_pi2%5Bcountry%5D=CH&tx_ehpaqualitylabel_pi2%5Bhp_type%5D=0&tx_ehpaqualitylabel_pi2%5Bdistributor%5D=191&tx_ehpaqualitylabel_pi2%5Bsubmit%5D=suchen","http://www.ehpa.org/uploads/qlcert/683/CH-HP-00270.pdf","Gütesiegel vorhanden"]
["WPF 35","Sole/Wasser","On/Off","http://www.ehpa.org/index.php?id=232&no_cache=1&L=1&tx_ehpaqualitylabel_pi2%5Bcountry%5D=CH&tx_ehpaqualitylabel_pi2%5Bhp_type%5D=0&tx_ehpaqualitylabel_pi2%5Bdistributor%5D=191&tx_ehpaqualitylabel_pi2%5Bsubmit%5D=suchen","http://www.ehpa.org/uploads/qlcert/683/CH-HP-00270.pdf","Gütesiegel vorhanden"]
["WPF 40","Sole/Wasser","On/Off","http://www.ehpa.org/index.php?id=232&no_cache=1&L=1&tx_ehpaqualitylabel_pi2%5Bcountry%5D=CH&tx_ehpaqualitylabel_pi2%5Bhp_type%5D=0&tx_ehpaqualitylabel_pi2%5Bdistributor%5D=191&tx_ehpaqualitylabel_pi2%5Bsubmit%5D=suchen","http://www.ehpa.org/uploads/qlcert/683/CH-HP-00270.pdf","Gütesiegel vorhanden"]
["WPF 52","Sole/Wasser","On/Off","http://www.ehpa.org/index.php?id=232&no_cache=1&L=1&tx_ehpaqualitylabel_pi2%5Bcountry%5D=CH&tx_ehpaqualitylabel_pi2%5Bhp_type%5D=0&tx_ehpaqualitylabel_pi2%5Bdistributor%5D=191&tx_ehpaqualitylabel_pi2%5Bsubmit%5D=suchen","http://www.ehpa.org/uploads/qlcert/683/CH-HP-00270.pdf","Gütesiegel vorhanden"]
["WPF 66","Sole/Wasser","On/Off","http://www.ehpa.org/index.php?id=232&no_cache=1&L=1&tx_ehpaqualitylabel_pi2%5Bcountry%5D=CH&tx_ehpaqualitylabel_pi2%5Bhp_type%5D=0&tx_ehpaqualitylabel_pi2%5Bdistributor%5D=191&tx_ehpaqualitylabel_pi2%5Bsubmit%5D=suchen","http://www.ehpa.org/uploads/qlcert/683/CH-HP-00270.pdf","Gütesiegel vorhanden"]
["Auswahl Wasser|Wasser Wärmepumpen"]
["WPC 04","Wasser/Wasser","On/Off","http://www.ehpa.org/index.php?id=233&no_cache=1&L=1&tx_ehpaqualitylabel_pi2%5Bmodel%5D=8785&cHash=0574df6bcc374213b31d47cdabe18eb1","http://www.ehpa.org/uploads/qlcert/1449/CH-HP-00513.pdf","Gütesiegel vorhanden"]
["WPC 04 cool","Wasser/Wasser","On/Off","http://www.ehpa.org/index.php?id=233&no_cache=1&L=1&tx_ehpaqualitylabel_pi2%5Bmodel%5D=8790&cHash=e69a56312a68e4ee317e3380978b2cbf","http://www.ehpa.org/uploads/qlcert/1449/CH-HP-00513.pdf","Gütesiegel vorhanden"]
["WPC 05","Wasser/Wasser","On/Off","http://www.ehpa.org/index.php?id=233&no_cache=1&L=1&tx_ehpaqualitylabel_pi2%5Bmodel%5D=8786&cHash=3474a79b07ed1470cf981f13407b8002","http://www.ehpa.org/uploads/qlcert/1449/CH-HP-00513.pdf","Gütesiegel vorhanden"]
["WPC 05 cool","Wasser/Wasser","On/Off","http://www.ehpa.org/index.php?id=233&no_cache=1&L=1&tx_ehpaqualitylabel_pi2%5Bmodel%5D=8791&cHash=b627fa89547d1968e8dec760b993024c","http://www.ehpa.org/uploads/qlcert/1449/CH-HP-00513.pdf","Gütesiegel vorhanden"]
["WPC 07","Wasser/Wasser","On/Off","http://www.ehpa.org/index.php?id=233&no_cache=1&L=1&tx_ehpaqualitylabel_pi2%5Bmodel%5D=8787&cHash=e5a20156c45900d21adad12677668137","http://www.ehpa.org/uploads/qlcert/1449/CH-HP-00513.pdf","Gütesiegel vorhanden"]
["WPC 07 cool","Wasser/Wasser","On/Off","http://www.ehpa.org/index.php?id=233&no_cache=1&L=1&tx_ehpaqualitylabel_pi2%5Bmodel%5D=8792&cHash=f8b918ac57c46c4ecce33a51da1d2783","http://www.ehpa.org/uploads/qlcert/1449/CH-HP-00513.pdf","Gütesiegel vorhanden"]
["WPC 10","Wasser/Wasser","On/Off","http://www.ehpa.org/index.php?id=233&no_cache=1&L=1&tx_ehpaqualitylabel_pi2%5Bmodel%5D=8788&cHash=bcd1380cee7b12a36050fe5820e9ee52","http://www.ehpa.org/uploads/qlcert/788/CH-HP-00304.pdf","Gütesiegel vorhanden"]
["WPC 10 cool","Wasser/Wasser","On/Off","http://www.ehpa.org/index.php?id=233&no_cache=1&L=1&tx_ehpaqualitylabel_pi2%5Bmodel%5D=8793&cHash=62f7e4600f72c70052fdbe053797db2b","http://www.ehpa.org/uploads/qlcert/788/CH-HP-00304.pdf","Gütesiegel vorhanden"]
["WPC 13","Wasser/Wasser","On/Off","http://www.ehpa.org/index.php?id=233&no_cache=1&L=1&tx_ehpaqualitylabel_pi2%5Bmodel%5D=8789&cHash=967fab9f26eda8717876b80d5aceae46","http://www.ehpa.org/uploads/qlcert/788/CH-HP-00304.pdf","Gütesiegel vorhanden"]
["WPC 13 cool","Wasser/Wasser","On/Off","http://www.ehpa.org/index.php?id=233&no_cache=1&L=1&tx_ehpaqualitylabel_pi2%5Bmodel%5D=8794&cHash=628510a96fe569b0de2487adc593ebdf","http://www.ehpa.org/uploads/qlcert/1449/CH-HP-00513.pdf","Gütesiegel vorhanden"]
["WPF 04","Wasser/Wasser","On/Off","http://www.ehpa.org/index.php?id=233&no_cache=1&L=1&tx_ehpaqualitylabel_pi2%5Bmodel%5D=8773&cHash=2eff272635722dc4ec8276342ac4d5a5","http://www.ehpa.org/uploads/qlcert/1449/CH-HP-00513.pdf","Gütesiegel vorhanden"]
["WPF 04 cool","Wasser/Wasser","On/Off","http://www.ehpa.org/index.php?id=233&no_cache=1&L=1&tx_ehpaqualitylabel_pi2%5Bmodel%5D=8779&cHash=82e2b9578cc498a16040acddd5179416","http://www.ehpa.org/uploads/qlcert/1449/CH-HP-00513.pdf","Gütesiegel vorhanden"]
{"$rows_left_out":16}